{"text_format":"1","workbook":"xlsx","n_sheets":3,"sheets":["Instructions","Balancer","Feed List"],"not_rendered":{"charts":0,"images":3,"macros":0,"external_links":0,"defined_names":2,"comments":0,"pivot_tables":0},"unopened":[],"bounds":{"document_bytes":16777216,"sheet_cells":100000,"rows_first":2000,"rows_last":500,"rows_between":2000,"halvings":0,"cell_chars":16384,"cell_head_chars":4096},"cells_cut":0,"cells_raw":0,"read":"whole","date_system":"1900"}

{"sheet":"Instructions","index":0,"n_rows":49,"n_cols":5,"rows_kept":49,"cut":false,"hidden":false,"merged":[[42,1,42,4]]}
[]
[]
[]
[]
[]
[]
[]
[]
[]
[]
[]
[]
[]
[]
[]
[]
[]
[]
[]
[]
[]
[]
[]
[]
[]
[]
[]
[]
[]
[]
[]
[]
[]
[]
[]
[]
[]
[]
[]
["In the Balancer worksheet understand the following:"]
["Cells with this color require a value."]
[]
[null,"Summary of Diet"]
["$/50 lbs.","CP%","Kcal/kg","Ca %","P %"]
[12.990000000000002,16,3000,3.8,0.5]
["The summary of the diet is calculated based on the % of feeds utilized."]
["Compare those numbers with the type of bird feeding to see if it meets its requirements."]
[]
["Feed Prices need to be changed in the feed list to be calculated correctly.  Any Nutrient analysis will be inputed here instead of table values."]

{"sheet":"Balancer","index":1,"n_rows":36,"n_cols":16,"rows_kept":36,"cut":false,"hidden":false,"merged":[[33,1,33,9],[34,1,34,9],[35,1,35,9],[17,6,17,9],[12,6,12,9],[19,2,19,4],[20,2,20,4],[24,2,24,4],[25,2,25,4],[31,2,31,4],[26,2,26,4],[27,2,27,4],[28,2,28,4],[29,2,29,4],[30,2,30,4],[0,0,0,1],[0,2,0,9],[21,2,21,4],[22,2,22,4],[23,2,23,4]]}
[null,null,"Poultry Ration Calculator V.2017",null,null,null,null,null,null,null,null,"Used"]
["#","%of Diet","Feed ID","Units(lbs)","Cost $/Unit","DM%","Protein %","ME kcal/kg","Ca %","P %","Price/lb","$/Ingredient","CP","TDN","Ca","P"]
[3,100,{"$f":"IFERROR(INDEX('Feed List'!$B$2:$I$91,MATCH(Balancer!$A3,'Feed List'!$A$2:$A$91,0),MATCH(Balancer!C$2,'Feed List'!$B$1:$I$1,0)),\"\")","v":"Comm. Layer Pellet (16)"},{"$f":"IFERROR(INDEX('Feed List'!$B$2:$I$91,MATCH(Balancer!$A3,'Feed List'!$A$2:$A$91,0),MATCH(Balancer!D$2,'Feed List'!$B$1:$I$1,0)),\"\")","v":50},{"$f":"IFERROR(INDEX('Feed List'!$B$2:$I$91,MATCH(Balancer!$A3,'Feed List'!$A$2:$A$91,0),MATCH(Balancer!E$2,'Feed List'!$B$1:$I$1,0)),\"\")","v":12.99},{"$f":"IFERROR(INDEX('Feed List'!$B$2:$I$91,MATCH(Balancer!$A3,'Feed List'!$A$2:$A$91,0),MATCH(Balancer!F$2,'Feed List'!$B$1:$I$1,0)),\"\")","v":89},{"$f":"IFERROR(INDEX('Feed List'!$B$2:$I$91,MATCH(Balancer!$A3,'Feed List'!$A$2:$A$91,0),MATCH(Balancer!G$2,'Feed List'!$B$1:$I$1,0)),\"\")","v":16},{"$f":"IFERROR(INDEX('Feed List'!$B$2:$I$91,MATCH(Balancer!$A3,'Feed List'!$A$2:$A$91,0),MATCH(Balancer!H$2,'Feed List'!$B$1:$I$1,0)),\"\")","v":3000},{"$f":"IFERROR(INDEX('Feed List'!$B$2:$I$91,MATCH(Balancer!$A3,'Feed List'!$A$2:$A$91,0),MATCH(Balancer!I$2,'Feed List'!$B$1:$I$1,0)),\"\")","v":3.8},{"$f":"IFERROR(INDEX('Feed List'!$B$2:$I$91,MATCH(Balancer!$A3,'Feed List'!$A$2:$A$91,0),MATCH(Balancer!J$2,'Feed List'!$B$1:$I$1,0)),\"\")","v":0.5},{"$f":"IFERROR(E3/D3,0)","v":0.25980000000000003},{"$f":"IFERROR(B3*K3/100,0)","v":0.25980000000000003},{"$f":"IFERROR(G3*B3/100,0)","v":16},{"$f":"IFERROR(H3*B3/100,0)","v":3000},{"$f":"IFERROR(I3*B3/100,0)","v":3.8},{"$f":"IFERROR(J3*B3/100,0)","v":0.5}]
[4,0,{"$f":"IFERROR(INDEX('Feed List'!$B$2:$I$91,MATCH(Balancer!$A4,'Feed List'!$A$2:$A$91,0),MATCH(Balancer!C$2,'Feed List'!$B$1:$I$1,0)),\"\")","v":"CORN DENT N0 2"},{"$f":"IFERROR(INDEX('Feed List'!$B$2:$I$91,MATCH(Balancer!$A4,'Feed List'!$A$2:$A$91,0),MATCH(Balancer!D$2,'Feed List'!$B$1:$I$1,0)),\"\")","v":100},{"$f":"IFERROR(INDEX('Feed List'!$B$2:$I$91,MATCH(Balancer!$A4,'Feed List'!$A$2:$A$91,0),MATCH(Balancer!E$2,'Feed List'!$B$1:$I$1,0)),\"\")","v":9.5},{"$f":"IFERROR(INDEX('Feed List'!$B$2:$I$91,MATCH(Balancer!$A4,'Feed List'!$A$2:$A$91,0),MATCH(Balancer!F$2,'Feed List'!$B$1:$I$1,0)),\"\")","v":88},{"$f":"IFERROR(INDEX('Feed List'!$B$2:$I$91,MATCH(Balancer!$A4,'Feed List'!$A$2:$A$91,0),MATCH(Balancer!G$2,'Feed List'!$B$1:$I$1,0)),\"\")","v":8.9},{"$f":"IFERROR(INDEX('Feed List'!$B$2:$I$91,MATCH(Balancer!$A4,'Feed List'!$A$2:$A$91,0),MATCH(Balancer!H$2,'Feed List'!$B$1:$I$1,0)),\"\")","v":3470},{"$f":"IFERROR(INDEX('Feed List'!$B$2:$I$91,MATCH(Balancer!$A4,'Feed List'!$A$2:$A$91,0),MATCH(Balancer!I$2,'Feed List'!$B$1:$I$1,0)),\"\")","v":0.02},{"$f":"IFERROR(INDEX('Feed List'!$B$2:$I$91,MATCH(Balancer!$A4,'Feed List'!$A$2:$A$91,0),MATCH(Balancer!J$2,'Feed List'!$B$1:$I$1,0)),\"\")","v":0.28000000000000003},{"$f":"IFERROR(E4/D4,0)","v":9.5000000000000001E-2},{"$f":"IFERROR(B4*K4/100,0)","v":0},{"$f":"IFERROR(G4*B4/100,0)","v":0},{"$f":"IFERROR(H4*B4/100,0)","v":0},{"$f":"IFERROR(I4*B4/100,0)","v":0},{"$f":"IFERROR(J4*B4/100,0)","v":0}]
[5,0,{"$f":"IFERROR(INDEX('Feed List'!$B$2:$I$91,MATCH(Balancer!$A5,'Feed List'!$A$2:$A$91,0),MATCH(Balancer!C$2,'Feed List'!$B$1:$I$1,0)),\"\")","v":"Corn Gluten Meal 60"},{"$f":"IFERROR(INDEX('Feed List'!$B$2:$I$91,MATCH(Balancer!$A5,'Feed List'!$A$2:$A$91,0),MATCH(Balancer!D$2,'Feed List'!$B$1:$I$1,0)),\"\")","v":40},{"$f":"IFERROR(INDEX('Feed List'!$B$2:$I$91,MATCH(Balancer!$A5,'Feed List'!$A$2:$A$91,0),MATCH(Balancer!E$2,'Feed List'!$B$1:$I$1,0)),\"\")","v":69.95},{"$f":"IFERROR(INDEX('Feed List'!$B$2:$I$91,MATCH(Balancer!$A5,'Feed List'!$A$2:$A$91,0),MATCH(Balancer!F$2,'Feed List'!$B$1:$I$1,0)),\"\")","v":91},{"$f":"IFERROR(INDEX('Feed List'!$B$2:$I$91,MATCH(Balancer!$A5,'Feed List'!$A$2:$A$91,0),MATCH(Balancer!G$2,'Feed List'!$B$1:$I$1,0)),\"\")","v":62},{"$f":"IFERROR(INDEX('Feed List'!$B$2:$I$91,MATCH(Balancer!$A5,'Feed List'!$A$2:$A$91,0),MATCH(Balancer!H$2,'Feed List'!$B$1:$I$1,0)),\"\")","v":3811},{"$f":"IFERROR(INDEX('Feed List'!$B$2:$I$91,MATCH(Balancer!$A5,'Feed List'!$A$2:$A$91,0),MATCH(Balancer!I$2,'Feed List'!$B$1:$I$1,0)),\"\")","v":0.06},{"$f":"IFERROR(INDEX('Feed List'!$B$2:$I$91,MATCH(Balancer!$A5,'Feed List'!$A$2:$A$91,0),MATCH(Balancer!J$2,'Feed List'!$B$1:$I$1,0)),\"\")","v":0.51},1.74875,0,0,0,0,0]
[6,0,{"$f":"IFERROR(INDEX('Feed List'!$B$2:$I$91,MATCH(Balancer!$A6,'Feed List'!$A$2:$A$91,0),MATCH(Balancer!C$2,'Feed List'!$B$1:$I$1,0)),\"\")","v":"COTTONSEED MEAL"},{"$f":"IFERROR(INDEX('Feed List'!$B$2:$I$91,MATCH(Balancer!$A6,'Feed List'!$A$2:$A$91,0),MATCH(Balancer!D$2,'Feed List'!$B$1:$I$1,0)),\"\")","v":2000},{"$f":"IFERROR(INDEX('Feed List'!$B$2:$I$91,MATCH(Balancer!$A6,'Feed List'!$A$2:$A$91,0),MATCH(Balancer!E$2,'Feed List'!$B$1:$I$1,0)),\"\")","v":294},{"$f":"IFERROR(INDEX('Feed List'!$B$2:$I$91,MATCH(Balancer!$A6,'Feed List'!$A$2:$A$91,0),MATCH(Balancer!F$2,'Feed List'!$B$1:$I$1,0)),\"\")","v":92},{"$f":"IFERROR(INDEX('Feed List'!$B$2:$I$91,MATCH(Balancer!$A6,'Feed List'!$A$2:$A$91,0),MATCH(Balancer!G$2,'Feed List'!$B$1:$I$1,0)),\"\")","v":41.4},{"$f":"IFERROR(INDEX('Feed List'!$B$2:$I$91,MATCH(Balancer!$A6,'Feed List'!$A$2:$A$91,0),MATCH(Balancer!H$2,'Feed List'!$B$1:$I$1,0)),\"\")","v":2320},{"$f":"IFERROR(INDEX('Feed List'!$B$2:$I$91,MATCH(Balancer!$A6,'Feed List'!$A$2:$A$91,0),MATCH(Balancer!I$2,'Feed List'!$B$1:$I$1,0)),\"\")","v":0.2},{"$f":"IFERROR(INDEX('Feed List'!$B$2:$I$91,MATCH(Balancer!$A6,'Feed List'!$A$2:$A$91,0),MATCH(Balancer!J$2,'Feed List'!$B$1:$I$1,0)),\"\")","v":1.05},0.14699999999999999,0,0,0,0,0]
[7,0,{"$f":"IFERROR(INDEX('Feed List'!$B$2:$I$91,MATCH(Balancer!$A7,'Feed List'!$A$2:$A$91,0),MATCH(Balancer!C$2,'Feed List'!$B$1:$I$1,0)),\"\")","v":"Flax Seed"},{"$f":"IFERROR(INDEX('Feed List'!$B$2:$I$91,MATCH(Balancer!$A7,'Feed List'!$A$2:$A$91,0),MATCH(Balancer!D$2,'Feed List'!$B$1:$I$1,0)),\"\")","v":50},{"$f":"IFERROR(INDEX('Feed List'!$B$2:$I$91,MATCH(Balancer!$A7,'Feed List'!$A$2:$A$91,0),MATCH(Balancer!E$2,'Feed List'!$B$1:$I$1,0)),\"\")","v":65.91},{"$f":"IFERROR(INDEX('Feed List'!$B$2:$I$91,MATCH(Balancer!$A7,'Feed List'!$A$2:$A$91,0),MATCH(Balancer!F$2,'Feed List'!$B$1:$I$1,0)),\"\")","v":93},{"$f":"IFERROR(INDEX('Feed List'!$B$2:$I$91,MATCH(Balancer!$A7,'Feed List'!$A$2:$A$91,0),MATCH(Balancer!G$2,'Feed List'!$B$1:$I$1,0)),\"\")","v":24.8},{"$f":"IFERROR(INDEX('Feed List'!$B$2:$I$91,MATCH(Balancer!$A7,'Feed List'!$A$2:$A$91,0),MATCH(Balancer!H$2,'Feed List'!$B$1:$I$1,0)),\"\")","v":3957},{"$f":"IFERROR(INDEX('Feed List'!$B$2:$I$91,MATCH(Balancer!$A7,'Feed List'!$A$2:$A$91,0),MATCH(Balancer!I$2,'Feed List'!$B$1:$I$1,0)),\"\")","v":0.25},{"$f":"IFERROR(INDEX('Feed List'!$B$2:$I$91,MATCH(Balancer!$A7,'Feed List'!$A$2:$A$91,0),MATCH(Balancer!J$2,'Feed List'!$B$1:$I$1,0)),\"\")","v":0.5},1.3182,0,0,0,0,0]
[9,0,{"$f":"IFERROR(INDEX('Feed List'!$B$2:$I$91,MATCH(Balancer!$A8,'Feed List'!$A$2:$A$91,0),MATCH(Balancer!C$2,'Feed List'!$B$1:$I$1,0)),\"\")","v":"OATS"},{"$f":"IFERROR(INDEX('Feed List'!$B$2:$I$91,MATCH(Balancer!$A8,'Feed List'!$A$2:$A$91,0),MATCH(Balancer!D$2,'Feed List'!$B$1:$I$1,0)),\"\")","v":2000},{"$f":"IFERROR(INDEX('Feed List'!$B$2:$I$91,MATCH(Balancer!$A8,'Feed List'!$A$2:$A$91,0),MATCH(Balancer!E$2,'Feed List'!$B$1:$I$1,0)),\"\")","v":110},{"$f":"IFERROR(INDEX('Feed List'!$B$2:$I$91,MATCH(Balancer!$A8,'Feed List'!$A$2:$A$91,0),MATCH(Balancer!F$2,'Feed List'!$B$1:$I$1,0)),\"\")","v":89},{"$f":"IFERROR(INDEX('Feed List'!$B$2:$I$91,MATCH(Balancer!$A8,'Feed List'!$A$2:$A$91,0),MATCH(Balancer!G$2,'Feed List'!$B$1:$I$1,0)),\"\")","v":13},{"$f":"IFERROR(INDEX('Feed List'!$B$2:$I$91,MATCH(Balancer!$A8,'Feed List'!$A$2:$A$91,0),MATCH(Balancer!H$2,'Feed List'!$B$1:$I$1,0)),\"\")","v":2625},{"$f":"IFERROR(INDEX('Feed List'!$B$2:$I$91,MATCH(Balancer!$A8,'Feed List'!$A$2:$A$91,0),MATCH(Balancer!I$2,'Feed List'!$B$1:$I$1,0)),\"\")","v":0.06},{"$f":"IFERROR(INDEX('Feed List'!$B$2:$I$91,MATCH(Balancer!$A8,'Feed List'!$A$2:$A$91,0),MATCH(Balancer!J$2,'Feed List'!$B$1:$I$1,0)),\"\")","v":0.27},5.5E-2,0,0,0,0,0]
[11,0,{"$f":"IFERROR(INDEX('Feed List'!$B$2:$I$91,MATCH(Balancer!$A9,'Feed List'!$A$2:$A$91,0),MATCH(Balancer!C$2,'Feed List'!$B$1:$I$1,0)),\"\")","v":"SOYMEAL 44"},{"$f":"IFERROR(INDEX('Feed List'!$B$2:$I$91,MATCH(Balancer!$A9,'Feed List'!$A$2:$A$91,0),MATCH(Balancer!D$2,'Feed List'!$B$1:$I$1,0)),\"\")","v":2000},{"$f":"IFERROR(INDEX('Feed List'!$B$2:$I$91,MATCH(Balancer!$A9,'Feed List'!$A$2:$A$91,0),MATCH(Balancer!E$2,'Feed List'!$B$1:$I$1,0)),\"\")","v":318},{"$f":"IFERROR(INDEX('Feed List'!$B$2:$I$91,MATCH(Balancer!$A9,'Feed List'!$A$2:$A$91,0),MATCH(Balancer!F$2,'Feed List'!$B$1:$I$1,0)),\"\")","v":89},{"$f":"IFERROR(INDEX('Feed List'!$B$2:$I$91,MATCH(Balancer!$A9,'Feed List'!$A$2:$A$91,0),MATCH(Balancer!G$2,'Feed List'!$B$1:$I$1,0)),\"\")","v":48.9},{"$f":"IFERROR(INDEX('Feed List'!$B$2:$I$91,MATCH(Balancer!$A9,'Feed List'!$A$2:$A$91,0),MATCH(Balancer!H$2,'Feed List'!$B$1:$I$1,0)),\"\")","v":2990},{"$f":"IFERROR(INDEX('Feed List'!$B$2:$I$91,MATCH(Balancer!$A9,'Feed List'!$A$2:$A$91,0),MATCH(Balancer!I$2,'Feed List'!$B$1:$I$1,0)),\"\")","v":0.28999999999999998},{"$f":"IFERROR(INDEX('Feed List'!$B$2:$I$91,MATCH(Balancer!$A9,'Feed List'!$A$2:$A$91,0),MATCH(Balancer!J$2,'Feed List'!$B$1:$I$1,0)),\"\")","v":0.65},0.159,0,0,0,0,0]
[15,0,{"$f":"IFERROR(INDEX('Feed List'!$B$2:$I$91,MATCH(Balancer!$A10,'Feed List'!$A$2:$A$91,0),MATCH(Balancer!C$2,'Feed List'!$B$1:$I$1,0)),\"\")","v":"ALFALFA PELLETS"},{"$f":"IFERROR(INDEX('Feed List'!$B$2:$I$91,MATCH(Balancer!$A10,'Feed List'!$A$2:$A$91,0),MATCH(Balancer!D$2,'Feed List'!$B$1:$I$1,0)),\"\")","v":2000},{"$f":"IFERROR(INDEX('Feed List'!$B$2:$I$91,MATCH(Balancer!$A10,'Feed List'!$A$2:$A$91,0),MATCH(Balancer!E$2,'Feed List'!$B$1:$I$1,0)),\"\")","v":130},{"$f":"IFERROR(INDEX('Feed List'!$B$2:$I$91,MATCH(Balancer!$A10,'Feed List'!$A$2:$A$91,0),MATCH(Balancer!F$2,'Feed List'!$B$1:$I$1,0)),\"\")","v":92},{"$f":"IFERROR(INDEX('Feed List'!$B$2:$I$91,MATCH(Balancer!$A10,'Feed List'!$A$2:$A$91,0),MATCH(Balancer!G$2,'Feed List'!$B$1:$I$1,0)),\"\")","v":17},{"$f":"IFERROR(INDEX('Feed List'!$B$2:$I$91,MATCH(Balancer!$A10,'Feed List'!$A$2:$A$91,0),MATCH(Balancer!H$2,'Feed List'!$B$1:$I$1,0)),\"\")","v":1485},{"$f":"IFERROR(INDEX('Feed List'!$B$2:$I$91,MATCH(Balancer!$A10,'Feed List'!$A$2:$A$91,0),MATCH(Balancer!I$2,'Feed List'!$B$1:$I$1,0)),\"\")","v":1.44},{"$f":"IFERROR(INDEX('Feed List'!$B$2:$I$91,MATCH(Balancer!$A10,'Feed List'!$A$2:$A$91,0),MATCH(Balancer!J$2,'Feed List'!$B$1:$I$1,0)),\"\")","v":0.22},6.5000000000000002E-2,0,0,0,0,0]
[51,0,{"$f":"IFERROR(INDEX('Feed List'!$B$2:$I$91,MATCH(Balancer!$A11,'Feed List'!$A$2:$A$91,0),MATCH(Balancer!C$2,'Feed List'!$B$1:$I$1,0)),\"\")","v":"LIMESTONE 38%"},{"$f":"IFERROR(INDEX('Feed List'!$B$2:$I$91,MATCH(Balancer!$A11,'Feed List'!$A$2:$A$91,0),MATCH(Balancer!D$2,'Feed List'!$B$1:$I$1,0)),\"\")","v":100},{"$f":"IFERROR(INDEX('Feed List'!$B$2:$I$91,MATCH(Balancer!$A11,'Feed List'!$A$2:$A$91,0),MATCH(Balancer!E$2,'Feed List'!$B$1:$I$1,0)),\"\")","v":2.25},{"$f":"IFERROR(INDEX('Feed List'!$B$2:$I$91,MATCH(Balancer!$A11,'Feed List'!$A$2:$A$91,0),MATCH(Balancer!F$2,'Feed List'!$B$1:$I$1,0)),\"\")","v":99.6},{"$f":"IFERROR(INDEX('Feed List'!$B$2:$I$91,MATCH(Balancer!$A11,'Feed List'!$A$2:$A$91,0),MATCH(Balancer!G$2,'Feed List'!$B$1:$I$1,0)),\"\")","v":0},{"$f":"IFERROR(INDEX('Feed List'!$B$2:$I$91,MATCH(Balancer!$A11,'Feed List'!$A$2:$A$91,0),MATCH(Balancer!H$2,'Feed List'!$B$1:$I$1,0)),\"\")","v":0},{"$f":"IFERROR(INDEX('Feed List'!$B$2:$I$91,MATCH(Balancer!$A11,'Feed List'!$A$2:$A$91,0),MATCH(Balancer!I$2,'Feed List'!$B$1:$I$1,0)),\"\")","v":39.4},{"$f":"IFERROR(INDEX('Feed List'!$B$2:$I$91,MATCH(Balancer!$A11,'Feed List'!$A$2:$A$91,0),MATCH(Balancer!J$2,'Feed List'!$B$1:$I$1,0)),\"\")","v":0.09},2.2499999999999999E-2,0,0,0,0,0]
[53,0,{"$f":"IFERROR(INDEX('Feed List'!$B$2:$I$91,MATCH(Balancer!$A12,'Feed List'!$A$2:$A$91,0),MATCH(Balancer!C$2,'Feed List'!$B$1:$I$1,0)),\"\")","v":"Oyster Shells"},{"$f":"IFERROR(INDEX('Feed List'!$B$2:$I$91,MATCH(Balancer!$A12,'Feed List'!$A$2:$A$91,0),MATCH(Balancer!D$2,'Feed List'!$B$1:$I$1,0)),\"\")","v":50},{"$f":"IFERROR(INDEX('Feed List'!$B$2:$I$91,MATCH(Balancer!$A12,'Feed List'!$A$2:$A$91,0),MATCH(Balancer!E$2,'Feed List'!$B$1:$I$1,0)),\"\")","v":9.99},{"$f":"IFERROR(INDEX('Feed List'!$B$2:$I$91,MATCH(Balancer!$A12,'Feed List'!$A$2:$A$91,0),MATCH(Balancer!F$2,'Feed List'!$B$1:$I$1,0)),\"\")","v":99},{"$f":"IFERROR(INDEX('Feed List'!$B$2:$I$91,MATCH(Balancer!$A12,'Feed List'!$A$2:$A$91,0),MATCH(Balancer!G$2,'Feed List'!$B$1:$I$1,0)),\"\")","v":0},{"$f":"IFERROR(INDEX('Feed List'!$B$2:$I$91,MATCH(Balancer!$A12,'Feed List'!$A$2:$A$91,0),MATCH(Balancer!H$2,'Feed List'!$B$1:$I$1,0)),\"\")","v":0},{"$f":"IFERROR(INDEX('Feed List'!$B$2:$I$91,MATCH(Balancer!$A12,'Feed List'!$A$2:$A$91,0),MATCH(Balancer!I$2,'Feed List'!$B$1:$I$1,0)),\"\")","v":33},{"$f":"IFERROR(INDEX('Feed List'!$B$2:$I$91,MATCH(Balancer!$A12,'Feed List'!$A$2:$A$91,0),MATCH(Balancer!J$2,'Feed List'!$B$1:$I$1,0)),\"\")","v":0},0.19980000000000001,0,0,0,0,0]
[null,{"$f":"SUM(B3:B12)","v":100},null,null,null,null,"Summary of Diet"]
[null,null,null,null,null,"$/50 lbs.","CP%","Kcal/kg","Ca %","P %"]
[null,null,null,null,null,{"$f":"SUM(L3:L12)*50","v":12.990000000000002},{"$f":"SUM(M3:M12)","v":16},{"$f":"SUM(N3:N12)","v":3000},{"$f":"SUM(O3:O12)","v":3.8},{"$f":"SUM(P3:P12)","v":0.5},null,{"$f":"COUNT(L3:L12)","v":10}]
[]
[]
[null,null,null,null,null,"Approx.","Nutrient Requirements (NRC 1994)"]
[null,null,"Bird Description",null,null,"Intake (lb/d)","CP%","Kcal/kg","Ca %","P %"]
[null,null,"Broilers 0-2 weeks",null,null,0.08,23,3200,1,0.45]
[null,null,"Broilers 2-5 weeks",null,null,0.3,20,3200,0.9,0.35]
[null,null,"Broilers 5-8 weeks",null,null,0.38,18,3200,0.8,0.3]
[null,null,"White egg laying type (Growing) 0-6 weeks",null,null,0.107,18,2850,0.9,0.4]
[null,null,"White egg laying type (Growing) 6-12 weeks",null,null,0.126,16,2850,0.8,0.35]
[null,null,"White egg laying type (Growing) 12-18 weeks",null,null,0.14169999999999999,15,2900,0.8,0.3]
[null,null,"White egg laying type (Growing) 18-first egg",null,null,0.157473,17,2900,2,0.32]
[null,null,"White egg layer (in production)",null,null,0.22,15,3250,3.25,0.25]
[null,null,"Brown egg laying type (Growing) 0-6 weeks",null,null,0.11,17,2800,0.9,0.4]
[null,null,"Brown egg laying type (Growing) 6-12 weeks",null,null,0.14000000000000001,15,2800,0.8,0.35]
[null,null,"Brown egg laying type (Growing) 12-18 weeks",null,null,0.16,14,2850,0.8,0.3]
[null,null,"Brown egg laying type (Growing) 18-first egg",null,null,0.17,16,2850,1.8,0.35]
[null,null,"Brown egg layer (in production)",null,null,0.25,14,3600,3,0.24]
[]
[null,"Developed at Oklahoma State University"]
[null,"by Brian Freking, Marty New, Earl Ward, and Dana Zook"]
[null,"Copyright 2013.  Oklahoma Board of Regents for A&M Colleges"]

{"sheet":"Feed List","index":2,"n_rows":91,"n_cols":9,"rows_kept":91,"cut":false,"hidden":false,"merged":[]}
[null,"Feed ID","Units(lbs)","Cost $/Unit","DM%","Protein %","ME kcal/kg","Ca %","P %"]
[1,"ALFALFA Leaf Meal",2000,150,89,26,2767,2.88,0.34]
[2,"BARLEY",2000,120,89,12.4,2900,0.06,0.47]
[3,"Comm. Layer Pellet (16)",50,12.99,89,16,3000,3.8,0.5]
[4,"CORN DENT N0 2",100,9.5,88,8.9,3470,0.02,0.28000000000000003]
[5,"Corn Gluten Meal 60",40,69.95,91,62,3811,0.06,0.51]
[6,"COTTONSEED MEAL",2000,294,92,41.4,2320,0.2,1.05]
[7,"Flax Seed",50,65.91,93,24.8,3957,0.25,0.5]
[8,"MILO, ROLL,GRND",2000,80,88,11,3376,0.04,0.3]
[9,"OATS",2000,110,89,13,2625,0.06,0.27]
[10,"Rye",50,14,88,12.1,2931,0.06,0.32]
[11,"SOYMEAL 44",2000,318,89,48.9,2990,0.28999999999999998,0.65]
[12,"SOYMEAL 49",2000,400,89,52,3300,0.27,0.62]
[13,"WHEAT",2000,80,89,14.1,3167,0.05,0.37]
[14]
[15,"ALFALFA PELLETS",2000,130,92,17,1485,1.44,0.22]
[16,"CANE MOLASSES",2000,78,77,5.8,1697.5419999999999,1,0.11]
[17,"CORN DIST GRAIN",2000,140,92,29.7,3097,0.17,0.72]
[18,"CORN GLUTEN FEED",2000,110,90,21,2228,0.4,0.8]
[19,"WHOLE COTTONSEED",2000,150,92,23.9,2519,0.15,0.6]
[20,"FAT",2000,275,99.2,0,6283,0,0]
[21,"FEATHER MEAL",2000,240,93,90,3276,0.33,0.55000000000000004]
[22,"HOMINY FEED",2000,120,90,11.1,3269,0.05,0.52]
[23,"MEAT MEAL",2000,240,94,54,1754,9.18,4.88]
[24,"MEAT & BONE CHIP",2000,240,90,43,1300.7140000000002,13.83,7.18]
[25,"MILO DIST GRAIN",2000,140,94,34.4,2228,0.2,0.68]
[26,"MUNGBEAN CRACKS",2000,100,90,25.38,2182.5540000000001,0.15,0.39]
[27,"PEANUT MEAL",2000,135,92,48,1985,0.18,0.6]
[28,"PEANUT HULLS",2000,35,91,7.8,1146.3920000000001,0.26,7.0000000000000007E-2]
[29,"Potatoe Waste, dry",2000,0,89,8,2050,0.16,0.25]
[30,"RICE BRAN",2000,110,91,14.1,1631.404,0.08,1.7]
[31,"RICE HULLS",2000,40,90,3.3,838,0.1,0.08]
[32,"RICE MILL FEED",2000,42,91.2,6.7,330.69000000000005,0.09,0.08]
[33,"SOYBEAN HULLS",2000,110,91,12.1,1873.9100000000003,0.49,0.21]
[34,"SUNFLOWER MEAL",2000,140,90,44.6,1763.6799999999998,0.49,1.26]
[35,"SUNFLOWER 31%",2000,170,90,33.54,1322.7600000000002,0.47,1.0900000000000001]
[36,"WHEAT MIDDS",2000,90,89,18.399999999999999,1851.8640000000003,0.13,1.18]
[37,"Barley Malt Sprouts",2000,90,94,28.1,1697.5419999999999,0.05,0.45]
[38]
[39]
[40]
[41]
[42]
[43]
[44]
[45]
[46,"VITAMIN A-30,000",100,140,90,0,0,0,0]
[47,"VITAMIN E-50%",100,440,90,0,0,0,0]
[48,"BOVATEC 68",100,455.6,90,0,0,0,0]
[49,"RUMENSIN 80",100,536,90,0,0,0,0]
[50,"DICAL",100,13.5,97,0,0,22,19.3]
[51,"LIMESTONE 38%",100,2.25,99.6,0,0,39.4,0.09]
[52,"MICROLITE",100,3,95.1,0,0,1.91,0.42]
[53,"Oyster Shells",50,9.99,99,0,0,33,0]
[54,"POTASSIUM CHLORI",100,10,99,0,0,0.05,0]
[55,"SALT",100,2.25,97,0,0,0,0]
[56,"UREA",100,9,99,288,0,0,0]
[57,"CALCIUM IODATE",100,807,99,0,0,0,0]
[58,"COBALT CARBONATE",100,851,99,0,0,0,0]
[59,"COBALT SULFATE",100,628,99,0,0,0,0]
[60,"COPPER SULFATE",100,57,99,0,0,0,0]
[61,"EDDI 79.5",100,957,99,0,0,0,0]
[62,"MAGNESIUM OXIDE",100,19.100000000000001,99,0,0,0,0]
[63,"MANGANOUS OXIDE",100,25.65,99,0,0,0,0]
[64,"POTASSIUM IODIDE",100,940,99,0,0,0,0]
[65,"SELENIUM 600",100,7,99,0,0,0,0]
[66,"ZINC OXIDE",100,60,97,0,0,0,0]
[67,"ZINC SULFATE",100,30.2,99,0,0,0,0]
[68]
[69]
[70]
[71]
[72]
[73]
[74]
[75]
[76]
[77]
[78]
[79]
[80]
[81]
[82]
[83]
[84]
[85]
[86]
[87]
[88]
[89]
[90]